Target
5-hydroxytryptamine receptor 1D
Ligand
BDBM50335602
Substrate
Meas. Tech.
ChEMBL_1757993 (CHEMBL4193001)
Ki
>10000±n/a nM
Citation
 Lin, ZSmith, MDConcepcion, GPHaygood, MGOlivera, BMLight, ASchmidt, EW Modulating the Serotonin Receptor Spectrum of Pulicatin Natural Products. J Nat Prod 80:2360-2370 (2017)  
Target
Name:
5-hydroxytryptamine receptor 1D
Synonyms:
5-HT-1D 5-HT1D 5HT1D_HUMAN HTR1DA Serotonin (5-HT) receptor | Serotonin Receptor 1D
Type:
G Protein-Coupled Receptor (GPCR)
Mol. Mass.:
41920.63
Organism:
Homo sapiens (Human)
Description:
Receptor binding assays were performed using human clone stably expressed in CHO cells.
Residue:
377
  
Inhibitor
Name:
BDBM50335602
Synonyms:
CHEMBL1651094 | Watasemycins B
Type:
Small organic molecule
Emp. Form.:
C16H20N2O3S2
Mol. Mass.:
352.472
SMILES:
C[C@@H]1SC(=N[C@H]1[C@H]1SC[C@@](C)(N1C)C(O)=O)c1ccccc1O
: