Target
5-hydroxytryptamine receptor 3A
Ligand
BDBM50335602
Substrate
Meas. Tech.
ChEMBL_1757997 (CHEMBL4193005)
Ki
>10000±n/a nM
Citation
 Lin, ZSmith, MDConcepcion, GPHaygood, MGOlivera, BMLight, ASchmidt, EW Modulating the Serotonin Receptor Spectrum of Pulicatin Natural Products. J Nat Prod 80:2360-2370 (2017)  
Target
Name:
5-hydroxytryptamine receptor 3A
Synonyms:
5-HT-3 5-HT3A 5-hydroxytryptamine receptor 3 (5-HT3) 5-hydroxytryptamine receptor 3A (5HT3A) 5HT3R HTR3A Serotonin 3 receptor (5HT3) Serotonin-gated ion channel receptor | Serotonin-gated ion channel receptor 3
Type:
Protein
Mol. Mass.:
55283.27
Organism:
Homo sapiens (Human)
Description:
P46098
Residue:
478
  
Inhibitor
Name:
BDBM50335602
Synonyms:
CHEMBL1651094 | Watasemycins B
Type:
Small organic molecule
Emp. Form.:
C16H20N2O3S2
Mol. Mass.:
352.472
SMILES:
C[C@@H]1SC(=N[C@H]1[C@H]1SC[C@@](C)(N1C)C(O)=O)c1ccccc1O
: