Target
Adenosine receptor A2a
Ligand
BDBM50457084
Substrate
Meas. Tech.
ChEMBL_1758724 (CHEMBL4193732)
Ki
0.070000±n/a nM
Target
Name:
Adenosine receptor A2a
Synonyms:
A2A adenosine receptor (hA2A) ADENOSINE A2 ADORA2 Adenosine A2A receptor (A2AAR)
Type:
G Protein-Coupled Receptor (GPCR)
Mol. Mass.:
44716.46
Organism:
Homo sapiens (Human)
Description:
P29274
Residue:
412
  
Inhibitor
Name:
BDBM50457084
Synonyms:
CHEMBL4217248
Type:
Small organic molecule
Emp. Form.:
C23H23F2N9O2
Mol. Mass.:
495.4846
SMILES:
Cn1c2c(nc(N)n3nc(nc23)-c2ccco2)n(CCN2CCN(CC2)c2ccc(F)cc2F)c1=O
: