Target
Adenosine receptor A2a
Ligand
BDBM50457085
Substrate
Meas. Tech.
ChEMBL_1758724 (CHEMBL4193732)
Ki
0.150000±n/a nM
Target
Name:
Adenosine receptor A2a
Synonyms:
A2A adenosine receptor (hA2A) ADENOSINE A2 ADORA2 Adenosine A2A receptor (A2AAR)
Type:
G Protein-Coupled Receptor (GPCR)
Mol. Mass.:
44716.46
Organism:
Homo sapiens (Human)
Description:
P29274
Residue:
412
  
Inhibitor
Name:
BDBM50457085
Synonyms:
CHEMBL4203542
Type:
Small organic molecule
Emp. Form.:
C25H25FN10O3
Mol. Mass.:
532.5296
SMILES:
Cc1nc2cc(N3CCN(CCn4c5nc(N)n6nc(nc6c5n(C)c4=O)-c4ccco4)CC3)c(F)cc2o1
: