Target
Beta-secretase 2
Ligand
BDBM50457586
Substrate
Meas. Tech.
ChEMBL_1760224 (CHEMBL4195232)
IC50
86±n/a nM
Citation
 Fuchino, KMitsuoka, YMasui, MKurose, NYoshida, SKomano, KYamamoto, TOgawa, MUnemura, CHosono, MIto, HSakaguchi, GAndo, SOhnishi, SKido, YFukushima, TMiyajima, HHiroyama, SKoyabu, KDhuyvetter, DBorghys, HGijsen, HJMYamano, YIso, YKusakabe, KI Rational Design of Novel 1,3-Oxazine Based ?-Secretase (BACE1) Inhibitors: Incorporation of a Double Bond To Reduce P-gp Efflux Leading to Robust A? Reduction in the Brain. J Med Chem 61:5122-5137 (2018)  
Target
Name:
Beta-secretase 2
Synonyms:
AEPLC ASP1 Asp 1 Aspartyl protease 1 BACE2_HUMAN Beta-secretase (BACE) Beta-secretase 2 (BACE-2) Beta-site APP-cleaving enzyme 2 Memapsin-1 beta-Secretase (BACE-2)
Type:
Protein
Mol. Mass.:
56171.20
Organism:
Homo sapiens (Human)
Description:
Q9Y5Z0
Residue:
518
  
Inhibitor
Name:
BDBM50457586
Synonyms:
CHEMBL4213486
Type:
Small organic molecule
Emp. Form.:
C19H15F2N5O2
Mol. Mass.:
383.3515
SMILES:
C[C@]1(C=C(CF)OC(N)=N1)c1cc(NC(=O)c2ccc(cn2)C#N)ccc1F
: