Target
Replicase polyprotein 1ab
Ligand
BDBM50458464
Substrate
Meas. Tech.
ChEMBL_1763458 (CHEMBL4198705)
IC50
800±n/a nM
Citation
 Galasiti Kankanamalage, ACKim, YDamalanka, VCRathnayake, ADFehr, ARMehzabeen, NBattaile, KPLovell, SLushington, GHPerlman, SChang, KOGroutas, WC Structure-guided design of potent and permeable inhibitors of MERS coronavirus 3CL protease that utilize a piperidine moiety as a novel design element. Eur J Med Chem 150:334-346 (2018)  
Target
Name:
Replicase polyprotein 1ab
Synonyms:
2.1.1.- 3.1.-.- 3.4.19.12 3.4.22.69 3.6.4.13 3CL-PRO ExoN Growth factor-like peptide Hel Host translation inhibitor nsp1 NendoU Non-structural protein 2 Non-structural protein 4 Non-structural protein 7 Non-structural protein 9 PL-PRO Pol RNA-directed RNA polymerase Replicase polyprotein 1ab nsp1 nsp12 nsp14 nsp16 nsp3 nsp5 nsp7 nsp9 pp1ab | rep
Type:
PROTEIN
Mol. Mass.:
789589.93
Organism:
Middle East respiratory syndrome-related coronavirus (isolate UnitedKingdom/H123990006/2012) (Betacoronavirus England 1) (Humancoronavirus EMC)
Description:
ChEMBL_117802
Residue:
7078
  
Inhibitor
Name:
BDBM50458464
Synonyms:
CHEMBL4202812
Type:
Small organic molecule
Emp. Form.:
C31H46N4O7
Mol. Mass.:
586.7195
SMILES:
CC(C)C[C@H](NC(=O)OC1(Cc2ccccc2)CCN(CC1)C(=O)OC(C)(C)C)C(=O)N[C@@H](C[C@@H]1CCNC1=O)C=O
: