Target
Aldo-keto reductase family 1 member B1
Ligand
BDBM50022342
Substrate
Meas. Tech.
ChEBML_31932
IC50
3500±n/a nM
Citation
 Mayfield, CADeRuiter, J Novel inhibitors of rat lens aldose reductase: N-[[(substituted amino)phenyl]sulfonyl]glycines. J Med Chem 30:1595-8 (1987)  
Target
Name:
Aldo-keto reductase family 1 member B1
Synonyms:
ALDR_RAT Akr1b4 Aldr1
Type:
PROTEIN
Mol. Mass.:
35797.87
Organism:
Rattus norvegicus
Description:
ChEMBL_1512484
Residue:
316
  
Inhibitor
Name:
BDBM50022342
Synonyms:
CHEMBL40681 | [4-(2-Benzyloxy-acetylamino)-benzenesulfonylamino]-acetic acid
Type:
Small organic molecule
Emp. Form.:
C17H18N2O6S
Mol. Mass.:
378.4
SMILES:
OC(=O)CNS(=O)(=O)c1ccc(NC(=O)COCc2ccccc2)cc1
: