Target
Adenosine receptor A1
Ligand
BDBM82020
Substrate
Meas. Tech.
ChEMBL_29452 (CHEMBL641037)
Ki
9000±n/a nM
Citation
 Peet, NPDickerson, GAAbdallah, AHDaly, JWUkena, D Benzo[1,2-c:5,4-c']dipyrazoles: non-xanthine adenosine antagonists. J Med Chem 31:2034-9 (1988)  
Target
Name:
Adenosine receptor A1
Synonyms:
AA1R_RAT ADENOSINE A1 high Adenosine A1 receptor (A1) Adenosine receptors A1 | Adora1
Type:
Protein
Mol. Mass.:
36704.13
Organism:
Rattus norvegicus (rat)
Description:
Residue:
326
  
Inhibitor
Name:
BDBM82020
Synonyms:
1-Methyl-3,9-dihydro-purine-2,6-dione(1-methyl xanthine) CAS_80220 NSC_80220
Type:
Small organic molecule
Emp. Form.:
C6H6N4O2
Mol. Mass.:
166.1374
SMILES:
Cn1c(=O)[nH]c2nc[nH]c2c1=O
: