Target
Renin
Ligand
BDBM50022000
Substrate
Meas. Tech.
ChEMBL_154903 (CHEMBL764680)
IC50
100±n/a nM
Citation
 Hui, KYCarlson, WDBernatowicz, MSHaber, E Analysis of structure-activity relationships in renin substrate analogue inhibitory peptides. J Med Chem 30:1287-95 (1987)  
Target
Name:
Renin
Synonyms:
Angiotensinogenase RENI_HUMAN
Type:
Enzyme
Mol. Mass.:
45058.99
Organism:
Homo sapiens (Human)
Description:
Residue:
406
  
Inhibitor
Name:
BDBM50022000
Synonyms:
CHEMBL2371853 | Pro-His-Pro-Phe-His-Statine-Val-Tyr-NH2
Type:
Small organic molecule
Emp. Form.:
C59H84N14O12
Mol. Mass.:
1181.3849
SMILES:
CC(C)C[C@H](NC(=O)[C@H](Cc1c[nH]cn1)NC(=O)[C@H](Cc1ccccc1)NC(=O)[C@@H]1CCCN1C(=O)[C@H](Cc1c[nH]cn1)NC(=O)[C@@H]1CCCN1)[C@@H](O)CC(=O)N[C@@H](C(C)C)C(=O)N[C@@H](Cc1ccc(O)cc1)C(=O)N[C@@H](CCCCN)C(O)=O
: