Target
Renin
Ligand
BDBM50022977
Substrate
Meas. Tech.
ChEMBL_154900 (CHEMBL764678)
IC50
8±n/a nM
Citation
 Hui, KYCarlson, WDBernatowicz, MSHaber, E Analysis of structure-activity relationships in renin substrate analogue inhibitory peptides. J Med Chem 30:1287-95 (1987)  
Target
Name:
Renin
Synonyms:
Angiotensinogenase RENI_HUMAN
Type:
Enzyme
Mol. Mass.:
45058.99
Organism:
Homo sapiens (Human)
Description:
Residue:
406
  
Inhibitor
Name:
BDBM50022977
Synonyms:
CHEMBL2371846 | Pro-His-Pro-Phe-His-Statine-Ile-His-Lys
Type:
Small organic molecule
Emp. Form.:
C57H84N16O11
Mol. Mass.:
1169.3775
SMILES:
CC[C@H](C)[C@H](NC(=O)C[C@H](O)[C@H](CC(C)C)NC(=O)[C@H](Cc1c[nH]cn1)NC(=O)[C@H](Cc1ccccc1)NC(=O)[C@@H]1CCCN1C(=O)[C@H](Cc1c[nH]cn1)NC(=O)[C@@H]1CCCN1)C(=O)N[C@@H](Cc1c[nH]cn1)C(=O)N[C@@H](CCCCN)C(O)=O
: