Target
Renin
Ligand
BDBM50022994
Substrate
Meas. Tech.
ChEBML_154903
IC50
430±n/a nM
Citation
 Hui, KYCarlson, WDBernatowicz, MSHaber, E Analysis of structure-activity relationships in renin substrate analogue inhibitory peptides. J Med Chem 30:1287-95 (1987)  
Target
Name:
Renin
Synonyms:
Angiotensinogenase RENI_HUMAN
Type:
Enzyme
Mol. Mass.:
45058.99
Organism:
Homo sapiens (Human)
Description:
Residue:
406
  
Inhibitor
Name:
BDBM50022994
Synonyms:
CHEMBL286316 | Pro-Phe-Phe-Statine-Ile-Phe-NH2
Type:
Small organic molecule
Emp. Form.:
C46H63N7O7
Mol. Mass.:
826.0351
SMILES:
CC[C@H](C)[C@H](NC(=O)CC(O)C(CC(C)C)NC(=O)[C@H](Cc1ccccc1)NC(=O)[C@H](Cc1ccccc1)NC(=O)[C@@H]1CCCN1)C(=O)NC(=O)[C@@H](N)Cc1ccccc1
: