Target
Renin
Ligand
BDBM50023028
Substrate
Meas. Tech.
ChEBML_196099
IC50
1500±n/a nM
Citation
 Luly, JRYi, NSoderquist, JStein, HCohen, JPerun, TJPlattner, JJ New inhibitors of human renin that contain novel Leu-Val replacements. J Med Chem 30:1609-16 (1987)  
Target
Name:
Renin
Synonyms:
Angiotensinogenase RENI_HUMAN
Type:
Enzyme
Mol. Mass.:
45058.99
Organism:
Homo sapiens (Human)
Description:
Residue:
406
  
Inhibitor
Name:
BDBM50023028
Synonyms:
CHEMBL3144149 | {1-[1-(2-Hydroxy-1-isobutyl-5-methyl-hexylcarbamoyl)-2-(1H-imidazol-4-yl)-ethylcarbamoyl]-2-phenyl-ethyl}-carbamic acid tert-butyl ester
Type:
Small organic molecule
Emp. Form.:
C31H49N5O5
Mol. Mass.:
571.7513
SMILES:
CC(C)CC[C@@H](O)[C@@H](CC(C)C)NC(=O)[C@H](Cc1c[nH]cn1)NC(=O)[C@H](Cc1ccccc1)NC(=O)OC(C)(C)C
: