Target
Renin
Ligand
BDBM50405545
Substrate
Meas. Tech.
ChEMBL_196095 (CHEMBL804779)
IC50
35.0±n/a nM
Citation
 Luly, JRYi, NSoderquist, JStein, HCohen, JPerun, TJPlattner, JJ New inhibitors of human renin that contain novel Leu-Val replacements. J Med Chem 30:1609-16 (1987)  
Target
Name:
Renin
Synonyms:
Angiotensinogenase RENI_HUMAN
Type:
Enzyme
Mol. Mass.:
45058.99
Organism:
Homo sapiens (Human)
Description:
Residue:
406
  
Inhibitor
Name:
BDBM50405545
Synonyms:
CHEMBL2115380 | CHEMBL3350696
Type:
Small organic molecule
Emp. Form.:
C33H51N5O5S
Mol. Mass.:
629.854
SMILES:
CC(C)C[C@H](NC(=O)[C@H](Cc1c[nH]cn1)NC(=O)[C@H](Cc1ccccc1)NC(=O)OC(C)(C)C)[C@@H](O)CSC1CCCCC1
: