Target
Renin
Ligand
BDBM50023091
Substrate
Meas. Tech.
ChEMBL_196264 (CHEMBL803241)
Ki
19±n/a nM
Citation
 Bock, MGDiPardo, RMEvans, BERittle, KEBoger, JPoe, MLaMont, BILynch, RJUlm, EHVlasuk, GP Renin inhibitors. Statine-containing tetrapeptides with varied hydrophobic carboxy termini. J Med Chem 30:1853-7 (1987)  
Target
Name:
Renin
Synonyms:
Angiotensinogenase RENI_HUMAN
Type:
Enzyme
Mol. Mass.:
45058.99
Organism:
Homo sapiens (Human)
Description:
Residue:
406
  
Inhibitor
Name:
BDBM50023091
Synonyms:
CHEMBL269752 | Iva-His-Pro-Phe-His-Sta-Leu-Phe-NH2
Type:
Small organic molecule
Emp. Form.:
C54H77N13O9
Mol. Mass.:
1052.2709
SMILES:
CC[C@](C)(N)C(=O)N[C@@H](Cc1cnc[nH]1)C(=O)N1CCC[C@H]1C(=O)N[C@@H](Cc1ccccc1)C(=O)N[C@@H](Cc1cnc[nH]1)C(=O)NC(CC(C)C)C(O)CC(=O)N[C@@H](CC(C)C)C(=O)N[C@@H](Cc1ccccc1)C(N)=O
: