Target
Renin
Ligand
BDBM50023095
Substrate
Meas. Tech.
ChEMBL_196266 (CHEMBL803243)
Ki
600±n/a nM
Citation
 Bock, MGDiPardo, RMEvans, BERittle, KEBoger, JPoe, MLaMont, BILynch, RJUlm, EHVlasuk, GP Renin inhibitors. Statine-containing tetrapeptides with varied hydrophobic carboxy termini. J Med Chem 30:1853-7 (1987)  
Target
Name:
Renin
Synonyms:
Angiotensinogenase RENI_HUMAN
Type:
Enzyme
Mol. Mass.:
45058.99
Organism:
Homo sapiens (Human)
Description:
Residue:
406
  
Inhibitor
Name:
BDBM50023095
Synonyms:
Boc-Phe-His-Sta-Leu-(+)-alpha-naphthylthylamide CHEMBL298510
Type:
Small organic molecule
Emp. Form.:
C46H63N7O7
Mol. Mass.:
826.0351
SMILES:
CC(C)CC(NC(=O)[C@H](Cc1cnc[nH]1)NC(=O)[C@H](Cc1ccccc1)NC(=O)OC(C)(C)C)C(O)CC(=O)N[C@@H](CC(C)C)C(=O)NC(C)c1ccc2ccccc2c1
: