Target
Renin
Ligand
BDBM50023093
Substrate
Meas. Tech.
ChEMBL_196265 (CHEMBL803242)
Ki
520±n/a nM
Citation
 Bock, MGDiPardo, RMEvans, BERittle, KEBoger, JPoe, MLaMont, BILynch, RJUlm, EHVlasuk, GP Renin inhibitors. Statine-containing tetrapeptides with varied hydrophobic carboxy termini. J Med Chem 30:1853-7 (1987)  
Target
Name:
Renin
Synonyms:
Angiotensinogenase RENI_HUMAN
Type:
Enzyme
Mol. Mass.:
45058.99
Organism:
Homo sapiens (Human)
Description:
Residue:
406
  
Inhibitor
Name:
BDBM50023093
Synonyms:
Boc-Phe-His-Sta-Leu-10,11-dihydro-5H-dibenzo[a,d]-cycloheptenamide | CHEMBL297880
Type:
Small organic molecule
Emp. Form.:
C50H65N7O7
Mol. Mass.:
876.0938
SMILES:
CC(C)CC(NC(=O)[C@H](Cc1cnc[nH]1)NC(=O)[C@H](Cc1ccccc1)NC(=O)OC(C)(C)C)C(O)CC(=O)N[C@@H](CC(C)C)C(=O)NC1Cc2ccccc2C(=C)c2ccccc12
: