Target
Peroxisome proliferator-activated receptor gamma
Ligand
BDBM50461063
Substrate
Meas. Tech.
ChEMBL_1770685 (CHEMBL4222797)
Kd
>10000±n/a nM
Citation
 Ouvry, GBihl, FBouix-Peter, CChristin, ODefoin-Platel, CDeret, SFeret, CFroude, DHacini-Rachinel, FHarris, CSHervouet, CLafitte, GLuzy, APMusicki, BOrfila, DParnet, VPascau, CPascau, JPierre, RRaffin, CRossio, PSpiesse, DTaquet, NThoreau, EVatinel, RVial, EHennequin, LF Sulfoximines as potent ROR? inverse agonists. Bioorg Med Chem Lett 28:1269-1273 (2018)  
Target
Name:
Peroxisome proliferator-activated receptor gamma
Synonyms:
NR1C3 PPAR-gamma PPARG_HUMAN Peroxisome proliferator-activated receptor gamma (PPAR gamma) Peroxisome proliferator-activated receptor gamma (PPARĪ³) peroxisome proliferator-activated receptor gamma isoform 2
Type:
Nuclear Receptor
Mol. Mass.:
57613.46
Organism:
Homo sapiens (Human)
Description:
P37231
Residue:
505
  
Inhibitor
Name:
BDBM50461063
Synonyms:
CHEMBL4226803 | US10457637, Compound 8
Type:
Small organic molecule
Emp. Form.:
C25H36N2O5S2
Mol. Mass.:
508.694
SMILES:
CCc1ccc(cc1)N(CC(C)C)S(=O)(=O)c1ccc(OCC2CCOCC2)c(c1)[S@@](C)(=N)=O
: