Target
Neutrophil elastase
Ligand
BDBM50023518
Substrate
Meas. Tech.
ChEMBL_63963 (CHEMBL677432)
Ki
70±n/a nM
Citation
 Miyano, MDeason, JRNakao, AStealey, MAVillamil, CISohn, DDMueller, RA (Acyloxy)benzophenones and (acyloxy)-4-pyrones. A new class of inhibitors of human neutrophil elastase. J Med Chem 31:1052-61 (1988)  
Target
Name:
Neutrophil elastase
Synonyms:
Bone marrow serine protease Coagulation factor X ELANE Elastase HLE Leukocyte elastase Medullasin Neutrophil elastase (HNE) PMN elastase Trypsin
Type:
Enzyme
Mol. Mass.:
28532.38
Organism:
Homo sapiens (Human)
Description:
P08246
Residue:
267
  
Inhibitor
Name:
BDBM50023518
Synonyms:
2,4-Bis-(2,2-dimethyl-propionyloxy)-benzoic acid 5-(2,2-dimethyl-propionyloxy)-4-oxo-4H-pyran-2-ylmethyl ester | CHEMBL10222
Type:
Small organic molecule
Emp. Form.:
C28H34O10
Mol. Mass.:
530.5636
SMILES:
CC(C)(C)C(=O)Oc1ccc(C(=O)OCc2cc(=O)c(OC(=O)C(C)(C)C)co2)c(OC(=O)C(C)(C)C)c1
: