Target
Genome polyprotein/Non-structural protein 4A
Ligand
BDBM50461551
Substrate
Meas. Tech.
ChEMBL_1771452 (CHEMBL4223564)
IC50
0.460000±n/a nM
Citation
 Venables, BLSin, NWang, AXSun, LQTu, YHernandez, DSheaffer, ALee, MDunaj, CZhai, GBarry, DFriborg, JYu, FKnipe, JSandquist, JFalk, PParker, DGood, ACRajamani, RMcPhee, FMeanwell, NAScola, PM P3-P4 ureas and reverse carbamates as potent HCV NS3 protease inhibitors: Effective transposition of the P4 hydrogen bond donor. Bioorg Med Chem Lett 28:1853-1859 (2018)  
Target
Name:
Genome polyprotein/Non-structural protein 4A
Synonyms:
Hepatitis C virus serine protease, NS3/NS4A
Type:
Mol. Mass.:
Description:
ASSAY_ID of ChEMBL is 1969955
Components:
This complex has 2 components.
Component 1
Name:
Non-structural protein 4A
Synonyms:
Hepatitis C virus NS4A protein Non-structural protein 4A
Type:
PROTEIN
Mol. Mass.:
5762.65
Organism:
Hepatitis C virus
Description:
ChEMBL_305334
Residue:
54
  
Component 2
Name:
Genome polyprotein
Synonyms:
Hepatitis C virus NS3 protease/helicase | Hepatitis C virus serine protease, NS3/NS4A
Type:
Protein
Mol. Mass.:
67067.41
Organism:
Hepatitis C virus
Description:
A3EZI9
Residue:
631
  
Inhibitor
Name:
BDBM50461551
Synonyms:
CHEMBL4229052
Type:
Small organic molecule
Emp. Form.:
C37H50N6O10S
Mol. Mass.:
770.892
SMILES:
COC(=O)[C@@H](NC(=O)N[C@H](C(=O)N1C[C@@H](C[C@H]1C(=O)N[C@@]1(C[C@H]1C=C)C(=O)NS(=O)(=O)C1CC1)Oc1nccc2cc(OC)ccc12)C(C)(C)C)C(C)C
: