Target
Transient receptor potential cation channel subfamily V member 2
Ligand
BDBM50150484
Substrate
Meas. Tech.
ChEMBL_1779722 (CHEMBL4236714)
IC50
>10000±n/a nM
Citation
 Schiano Moriello, ALópez Chinarro, SNovo Fernández, OEras, JAmodeo, PCanela-Garayoa, RVitale, RMDi Marzo, VDe Petrocellis, L Elongation of the Hydrophobic Chain as a Molecular Switch: Discovery of Capsaicin Derivatives and Endogenous Lipids as Potent Transient Receptor Potential Vanilloid Channel 2 Antagonists. J Med Chem 61:8255-8281 (2018)  
Target
Name:
Transient receptor potential cation channel subfamily V member 2
Synonyms:
Sac2b Transient receptor potential cation channel subfamily V member 2 Vanilloid receptor | Vrl1
Type:
PROTEIN
Mol. Mass.:
86707.60
Organism:
Rattus norvegicus
Description:
ChEMBL_768011
Residue:
761
  
Inhibitor
Name:
BDBM50150484
Synonyms:
(Z)-9-octadecenoic acid CHEMBL8659 Octadec-9-enoic acid oleicacid
Type:
Small organic molecule
Emp. Form.:
C18H34O2
Mol. Mass.:
282.4614
SMILES:
CCCCCCCC\C=C/CCCCCCCC(O)=O
: