Target
Bromodomain-containing protein 4
Ligand
BDBM50464128
Substrate
Meas. Tech.
ChEMBL_1780008 (CHEMBL4237000)
IC50
25119±n/a nM
Citation
 Bamborough, PChung, CWFurze, RCGrandi, PMichon, AMWatson, RJMitchell, DJBarnett, HPrinjha, RKRau, CSheppard, RJWerner, TDemont, EH Aiming to Miss a Moving Target: Bromo and Extra Terminal Domain (BET) Selectivity in Constrained ATAD2 Inhibitors. J Med Chem 61:8321-8336 (2018)  
Target
Name:
Bromodomain-containing protein 4
Synonyms:
BRD4 Bromodomain-containing protein 4 (BRD4) Protein HUNK1
Type:
Protein
Mol. Mass.:
152264.84
Organism:
Homo sapiens (Human)
Description:
O60885
Residue:
1362
  
Inhibitor
Name:
BDBM50464128
Synonyms:
CHEMBL4206758
Type:
Small organic molecule
Emp. Form.:
C28H35F2N5O3
Mol. Mass.:
527.606
SMILES:
CO[C@H]1CNC[C@@H](OCC2CCC(F)(F)CC2)[C@@H]1Nc1ncc(-c2cncc(C)c2)c2cc(C)c(=O)[nH]c12
: