Target
Transcriptional activator protein LasR
Ligand
BDBM50465709
Substrate
Meas. Tech.
ChEMBL_1788573 (CHEMBL4260307)
IC50
640±n/a nM
Citation
 Soukarieh, FWilliams, PStocks, MJCámara, M Pseudomonas aeruginosa Quorum Sensing Systems as Drug Discovery Targets: Current Position and Future Perspectives. J Med Chem 61:10385-10402 (2018)  
Target
Name:
Transcriptional activator protein LasR
Synonyms:
LASR_PSEAE | lasR
Type:
PROTEIN
Mol. Mass.:
26618.24
Organism:
Pseudomonas aeruginosa
Description:
ChEMBL_1475312
Residue:
239
  
Inhibitor
Name:
BDBM50465709
Synonyms:
8-Azaguanine | CHEBI:63486
Type:
Small organic molecule
Emp. Form.:
C4H4N6O
Mol. Mass.:
152.1142
SMILES:
Nc1nc(O)c2[nH]nnc2n1
: