Target
Alcohol dehydrogenase class-3
Ligand
BDBM50465829
Substrate
Meas. Tech.
ChEMBL_1788804 (CHEMBL4260538)
IC50
11±n/a nM
Citation
 Muthukaman, NDeshmukh, STondlekar, STambe, MPisal, DSarode, NMhatre, SChakraborti, SShah, DBhosale, VMKulkarni, AMahat, MYAJadhav, SBGudi, GSKhairatkar-Joshi, NGharat, LA Discovery of 5-(2-chloro-4'-(1H-imidazol-1-yl)-[1,1'-biphenyl]-4-yl)-1H-tetrazole as potent and orally efficacious S-nitrosoglutathione reductase (GSNOR) inhibitors for the potential treatment of COPD. Bioorg Med Chem Lett 28:3766-3773 (2018)  
Target
Name:
Alcohol dehydrogenase class-3
Synonyms:
1.1.1.- 1.1.1.284 ADHX Alcohol dehydrogenase 5 Alcohol dehydrogenase class-3 FALDH Glutathione-dependent formaldehyde dehydrogenase (GSH-FDH) alcohol dehydrogenase 3 (ADH-3)
Type:
Mol. Mass.:
39728.34
Organism:
Homo sapiens (Human)
Description:
P11766
Residue:
374
  
Inhibitor
Name:
BDBM50465829
Synonyms:
CHEMBL4289979
Type:
Small organic molecule
Emp. Form.:
C18H15FN6
Mol. Mass.:
334.3503
SMILES:
CCc1cc(ccc1-c1ccc(cc1F)-c1nnn[nH]1)-n1ccnc1
: