Target
Adenosine receptor A1
Ligand
BDBM50025687
Substrate
Meas. Tech.
ChEBML_29624
Ki
9.3±n/a nM
Citation
 Jacobson, KAUkena, DPadgett, WDaly, JWKirk, KL Xanthine functionalized congeners as potent ligands at A2-adenosine receptors. J Med Chem 30:211-4 (1987)  
Target
Name:
Adenosine receptor A1
Synonyms:
AA1R_RAT ADENOSINE A1 high Adenosine A1 receptor (A1) Adenosine receptors A1 | Adora1
Type:
Protein
Mol. Mass.:
36704.13
Organism:
Rattus norvegicus (rat)
Description:
Residue:
326
  
Inhibitor
Name:
BDBM50025687
Synonyms:
2-[4-(1,3-Diethyl-2,6-dioxo-2,3,6,7-tetrahydro-1H-purin-8-yl)-phenoxy]-N-p-tolyl-acetamide | CHEMBL16866
Type:
Small organic molecule
Emp. Form.:
C24H25N5O4
Mol. Mass.:
447.4864
SMILES:
CCn1c2nc([nH]c2c(=O)n(CC)c1=O)-c1ccc(OCC(=O)Nc2ccc(C)cc2)cc1
: