Target
Renin
Ligand
BDBM50016026
Substrate
Meas. Tech.
ChEMBL_196261 (CHEMBL803238)
Ki
43±n/a nM
Citation
 Evans, BERittle, KEBock, MGBennett, CDDiPardo, RMBoger, JPoe, MUlm, EHLaMont, BIBlaine, EH A uniquely potent renin inhibitor and its unanticipated plasma binding component. J Med Chem 28:1755-6 (1986)  
Target
Name:
Renin
Synonyms:
Angiotensinogenase RENI_HUMAN
Type:
Enzyme
Mol. Mass.:
45058.99
Organism:
Homo sapiens (Human)
Description:
Residue:
406
  
Inhibitor
Name:
BDBM50016026
Synonyms:
CHEMBL424543 | [1-(1-{1-[2-(1-Benzylcarbamoyl-3-methyl-butylcarbamoyl)-1-hydroxy-ethyl]-3-methyl-butylcarbamoyl}-2-phenyl-ethylcarbamoyl)-2-phenyl-ethyl]-carbamic acid tert-butyl ester
Type:
Small organic molecule
Emp. Form.:
C44H61N5O7
Mol. Mass.:
771.9844
SMILES:
CC(C)C[C@H](NC(=O)[C@H](Cc1ccccc1)NC(=O)[C@H](Cc1ccccc1)NC(=O)OC(C)(C)C)C(O)CC(=O)N[C@@H](CC(C)C)C(=O)NCc1ccccc1
: