Target
60 kDa heat shock protein, mitochondrial
Ligand
BDBM50350465
Substrate
Meas. Tech.
ChEMBL_1797985 (CHEMBL4270102)
IC50
>100000±n/a nM
Citation
 Kunkle, TAbdeen, SSalim, NRay, AMStevens, MAmbrose, AJVictorino, JPark, YHoang, QQChapman, EJohnson, SM Hydroxybiphenylamide GroEL/ES Inhibitors Are Potent Antibacterials against Planktonic and Biofilm Forms of Staphylococcus aureus. J Med Chem 61:10651-10664 (2018)  
Target
Name:
60 kDa heat shock protein, mitochondrial
Synonyms:
3.6.4.9 60 kDa heat shock protein, mitochondrial CPN60 HSP-60 HSP60/HSP10 Heat shock protein 60 Mitochondrial matrix protein P1 | P60 lymphocyte protein
Type:
PROTEIN
Mol. Mass.:
61050.41
Organism:
Homo sapiens
Description:
ChEMBL_117701
Residue:
573
  
Inhibitor
Name:
BDBM50350465
Synonyms:
AMPICILLIN Amcill Ampicillin sulfate
Type:
Small organic molecule
Emp. Form.:
C16H19N3O4S
Mol. Mass.:
349.405
SMILES:
CC1(C)S[C@@H]2[C@H](NC(=O)[C@H](N)c3ccccc3)C(=O)N2[C@H]1C(O)=O
: