Target
Melatonin receptor type 1A/1B
Ligand
BDBM50469788
Substrate
Meas. Tech.
ChEMBL_104785 (CHEMBL714928)
Ki
4.3±n/a nM
Citation
 Spadoni, GStankov, BDuranti, ABiella, GLucini, VSalvatori, AFraschini, F 2-Substituted 5-methoxy-N-acyltryptamines: synthesis, binding affinity for the melatonin receptor, and evaluation of the biological activity. J Med Chem 36:4069-74 (1993)  
Target
Name:
Melatonin receptor type 1A/1B
Synonyms:
Melatonin receptor
Type:
Mol. Mass.:
Description:
ASSAY_ID of ChEMBL is 104946
Components:
This complex has 2 components.
Component 1
Name:
Melatonin receptor type 1A
Synonyms:
MTNR1A MTR1A_HUMAN Mel1a melatonin receptor Melatonin receptor Melatonin receptor type 1 (MT1) | Melatonin receptor type 1A
Type:
Enzyme
Mol. Mass.:
39392.94
Organism:
Homo sapiens (Human)
Description:
P48039
Residue:
350
  
Component 2
Name:
Melatonin receptor type 1B
Synonyms:
MTNR1B Mel-1B-R Melatonin 1B Melatonin receptor type 1B | Melatonin receptor type 2 (MT2)
Type:
Enzyme
Mol. Mass.:
40203.54
Organism:
Homo sapiens (Human)
Description:
P49286
Residue:
362
  
Inhibitor
Name:
BDBM50469788
Synonyms:
CHEMBL340115
Type:
Small organic molecule
Emp. Form.:
C16H22N2O2
Mol. Mass.:
274.3581
SMILES:
COc1ccc2[nH]c(C(C)C)c(CCNC(C)=O)c2c1
: