Target
Progesterone receptor
Ligand
BDBM50026617
Substrate
Meas. Tech.
ChEMBL_159709 (CHEMBL764185)
Ki
1.81±n/a nM
Citation
 Hoyte, RMRosner, WJohnson, ISZielinski, JHochberg, RB Synthesis and evaluation of potential radioligands for the progesterone receptor. J Med Chem 28:1695-9 (1985)  
Target
Name:
Progesterone receptor
Synonyms:
NR3C3 PRGR_RABIT
Type:
PROTEIN
Mol. Mass.:
98665.51
Organism:
Oryctolagus cuniculus
Description:
ChEMBL_775980
Residue:
930
  
Inhibitor
Name:
BDBM50026617
Synonyms:
17-Hydroxy-17-(2-iodo-vinyl)-13-methyl-1,2,6,7,8,9,10,11,12,13,14,15,16,17-tetradecahydro-cyclopenta[a]phenanthren-3-one | CHEMBL45777
Type:
Small organic molecule
Emp. Form.:
C20H27IO2
Mol. Mass.:
426.3317
SMILES:
CC12CCC3C(CCC4=CC(=O)CCC34)C1CCC2(O)\C=C\I
: