Target
Alpha-1A adrenergic receptor
Ligand
BDBM50001901
Substrate
Meas. Tech.
ChEBML_33092
Ki
160±n/a nM
Citation
 Saari, WSHalczenko, WKing, SWHuff, JRGuare, JPHunt, CARandall, WCAnderson, PSLotti, VJTaylor, DA Pyridinylpiperazines, a new class of selective alpha 2-adrenoceptor antagonists. J Med Chem 26:1696-701 (1984)  
Target
Name:
Alpha-1A adrenergic receptor
Synonyms:
ADA1A_BOVIN ADRA1C Alpha 1A-adrenoreceptor Cerebral cortex alpha adrenergic receptor | adrenergic Alpha1
Type:
Enzyme Catalytic Domain
Mol. Mass.:
51492.08
Organism:
CALF
Description:
adrenergic Alpha1 0 CALF
Residue:
466
  
Inhibitor
Name:
BDBM50001901
Synonyms:
1-(2-Chloro-phenyl)-piperazine | CHEMBL9841
Type:
Small organic molecule
Emp. Form.:
C10H13ClN2
Mol. Mass.:
196.677
SMILES:
Clc1ccccc1N1CCNCC1
: