Target
5-hydroxytryptamine receptor 3A
Ligand
BDBM50130276
Substrate
Meas. Tech.
ChEMBL_3120 (CHEMBL617963)
Ki
<1000±n/a nM
Citation
 Kikuchi, CAndo, TWatanabe, TNagaso, HOkuno, MHiranuma, TKoyama, M 2a-[4-(Tetrahydropyridoindol-2-yl)butyl]tetrahydrobenzindole derivatives: new selective antagonists of the 5-hydroxytryptamine7 receptor. J Med Chem 45:2197-206 (2002)  
Target
Name:
5-hydroxytryptamine receptor 3A
Synonyms:
5-HT-3 5-HT3A 5-HT3R 5-hydroxytryptamine receptor 3A 5ht3 Htr3a Serotonin 3a (5-HT3a) receptor Serotonin-gated ion channel receptor
Type:
Mol. Mass.:
56056.00
Organism:
Mus musculus (house mouse)
Description:
5HT3A
Residue:
487
  
Inhibitor
Name:
BDBM50130276
Synonyms:
CHEMBL553794 | N-Methyl-2-{2-[4-(2-oxo-1,2,4,5-tetrahydro-3H-benzo[cd]indol-2a-yl)-butyl]-1,2,3,4-tetrahydro-beta-carbolin-9-yl}-acetamide
Type:
Small organic molecule
Emp. Form.:
C29H34N4O2
Mol. Mass.:
470.6059
SMILES:
CNC(=O)Cn1c2CN(CCCCC34CCCc5cccc(NC3=O)c45)CCc2c2ccccc12
: