Target
Serine protease 1
Ligand
BDBM50027283
Substrate
Meas. Tech.
ChEBML_212516
Ki
>1000000±n/a nM
Citation
 Tidwell, RRGeratz, JDDubovi, EJ Aromatic amidines: comparison of their ability to block respiratory syncytial virus induced cell fusion and to inhibit plasmin, urokinase, thrombin, and trypsin. J Med Chem 26:294-8 (1983)  
Target
Name:
Serine protease 1
Synonyms:
Beta-Trypsin PRSS1 TRY1 TRYP1 Trypsin I
Type:
Enzyme
Mol. Mass.:
25790.52
Organism:
Bos taurus (bovine)
Description:
P00760
Residue:
246
  
Inhibitor
Name:
BDBM50027283
Synonyms:
3-Acetyl-1H-indole-6-carboxamidine | CHEMBL321524
Type:
Small organic molecule
Emp. Form.:
C11H11N3O
Mol. Mass.:
201.2245
SMILES:
CC(=O)c1c[nH]c2cc(ccc12)C(N)=N
: