Target
5-hydroxytryptamine receptor 7
Ligand
BDBM50366495
Substrate
Meas. Tech.
ChEMBL_3786 (CHEMBL619862)
Ki
63±n/a nM
Citation
 López-Rodríguez, MLPorras, EMorcillo, MJBenhamú, BSoto, LJLavandera, JLRamos, JAOlivella, MCampillo, MPardo, L Optimization of the pharmacophore model for 5-HT7R antagonism. Design and synthesis of new naphtholactam and naphthosultam derivatives. J Med Chem 46:5638-50 (2003)  
Target
Name:
5-hydroxytryptamine receptor 7
Synonyms:
5-HT-7 5-HT7 5-HT7S 5HT7 HTR7 | Serotonin receptor 7
Type:
G Protein-Coupled Receptor (GPCR)
Mol. Mass.:
53573.08
Organism:
Homo sapiens (Human)
Description:
P34969
Residue:
479
  
Inhibitor
Name:
BDBM50366495
Synonyms:
(+)butaclamol | CHEMBL1255588
Type:
Small organic molecule
Emp. Form.:
C25H31NO
Mol. Mass.:
361.5197
SMILES:
CC(C)(C)[C@@]1(O)CCN2C[C@@H]3c4ccccc4CCc4cccc([C@H]2C1)c34
: