Target
Amyloid-beta precursor protein
Ligand
BDBM50109052
Substrate
Meas. Tech.
ChEMBL_596771 (CHEMBL1039059)
Ki
1.3±n/a nM
Citation
 Kung, HFChoi, SRQu, WZhang, WSkovronsky, D 18F stilbenes and styrylpyridines for PET imaging of A beta plaques in Alzheimer's disease: a miniperspective. J Med Chem 53:933-41 (2010)  
Target
Name:
Amyloid-beta precursor protein
Synonyms:
A4 ABPP AICD-50 AICD-59 AID(57) APP Alzheimer disease amyloid protein Amyloid beta Protein Amyloid beta protein Abeta(1-42) Amyloid intracellular domain 57 Amyloid protein (Abeta42b) Beta amyloid A4 protein Beta-APP42 Beta-amyloid protein 42 C83 CVAP Gamma Secretase Gamma-CTF(57) Gamma-secretase Gamma-secretase C-terminal fragment 57 P3(40) PN-II Protease nexin-II S-APP-beta Soluble APP-beta | beta-Amyloid Precursor Protein (APP)
Type:
Single-pass type I membrane protein
Mol. Mass.:
86890.41
Organism:
Homo sapiens (Human)
Description:
P05067
Residue:
770
  
Inhibitor
Name:
BDBM50109052
Synonyms:
(4-Benzothiazol-2-yl-phenyl)-methyl-amine CHEMBL93334 | US10137210, Example [N-methyl-11C]BTA-1
Type:
Small organic molecule
Emp. Form.:
C14H12N2S
Mol. Mass.:
240.323
SMILES:
CNc1ccc(cc1)-c1nc2ccccc2s1
: