Target
Dihydrofolate reductase
Ligand
BDBM50028542
Substrate
Meas. Tech.
ChEBML_54593
Ki
0.002800±n/a nM
Citation
 Piper, JRMontgomery, JASirotnak, FMChello, PL Syntheses of alpha- and gamma-substituted amides, peptides, and esters of methotrexate and their evaluation as inhibitors of folate metabolism. J Med Chem 25:182-7 (1982)  
Target
Name:
Dihydrofolate reductase
Synonyms:
DYR_MOUSE | Dhfr
Type:
Enzyme
Mol. Mass.:
21608.82
Organism:
Mus musculus (Mouse)
Description:
Residue:
187
  
Inhibitor
Name:
BDBM50028542
Synonyms:
CHEMBL293546 | derivative of methotrexate
Type:
Small organic molecule
Emp. Form.:
C24H27N9O8
Mol. Mass.:
569.5267
SMILES:
CN(Cc1cnc2nc(N)nc(N)c2n1)c1ccc(cc1)C(=O)NC(CCC(=O)N[C@@H](CC(O)=O)C(O)=O)C(O)=O
: