Target
Neuraminidase
Ligand
BDBM7462
Substrate
Meas. Tech.
ChEMBL_632580 (CHEMBL1114806)
IC50
59300±n/a nM
Citation
 Mercader, AGPomilio, AB QSAR study of flavonoids and biflavonoids as influenza H1N1 virus neuraminidase inhibitors. Eur J Med Chem 45:1724-30 (2010)  
Target
Name:
Neuraminidase
Synonyms:
Influenza A Virus Neuraminidase NRAM_I34A1 Neuraminidase A
Type:
Enzyme
Mol. Mass.:
50124.14
Organism:
Influenza A virus (A/Puerto Rico/8/34/Mount Sinai(H1N1))
Description:
P03468
Residue:
454
  
Inhibitor
Name:
BDBM7462
Synonyms:
3,5,7-trihydroxy-2-(4-hydroxyphenyl)-4H-chromen-4-one CHEMBL150 Kaempferol (Kmp) kaempferol
Type:
Small organic molecule
Emp. Form.:
C15H10O6
Mol. Mass.:
286.2363
SMILES:
Oc1ccc(cc1)-c1oc2cc(O)cc(O)c2c(=O)c1O
: