Target
Adenosine deaminase
Ligand
BDBM50028246
Substrate
Meas. Tech.
ChEMBL_30781 (CHEMBL645058)
Ki
680±n/a nM
Citation
 Woo, PWBaker, DC Inhibitors of adenosine deaminase. Studies in combining high-affinity enzyme-binding structural units. erythro-1,6-Dihydro-6-(hydroxymethyl)-9-(2-hydroxy-3-nonyl)purine and erythro-9-(2-hydroxy-3-nonyl)purine. J Med Chem 25:603-5 (1982)  
Target
Name:
Adenosine deaminase
Synonyms:
ADA Adenosine aminohydrolase
Type:
Enzyme
Mol. Mass.:
40910.44
Organism:
Bos taurus (bovine)
Description:
Residue:
363
  
Inhibitor
Name:
BDBM50028246
Synonyms:
3-Purin-9-yl-nonan-2-ol | CHEMBL321338
Type:
Small organic molecule
Emp. Form.:
C14H22N4O
Mol. Mass.:
262.3507
SMILES:
CCCCCCC(C(C)O)n1cnc2cncnc12
: