Target
Probable maltase-glucoamylase 2
Ligand
BDBM50502036
Substrate
Meas. Tech.
ChEMBL_1806320 (CHEMBL4305679)
IC50
70±n/a nM
Citation
 Dhameja, MGupta, P Synthetic heterocyclic candidates as promising ?-glucosidase inhibitors: An overview. Eur J Med Chem 176:343-377 (2019)  
Target
Name:
Probable maltase-glucoamylase 2
Synonyms:
3.2.1.3 Glucoamylase MGAM2 Probable maltase-glucoamylase 2
Type:
PROTEIN
Mol. Mass.:
277932.17
Organism:
Homo sapiens
Description:
ChEMBL_116927
Residue:
2515
  
Inhibitor
Name:
BDBM50502036
Synonyms:
CHEMBL4468520
Type:
Small organic molecule
Emp. Form.:
C48H30N8O11S2
Mol. Mass.:
958.929
SMILES:
[O-][N+](=O)c1ccc(cc1)C(Nc1ccc(Oc2ccc(NC(c3ccc(cc3)[N+]([O-])=O)n3nc(oc3=S)-c3cc4ccccc4oc3=O)cc2)cc1)n1nc(oc1=S)-c1cc2ccccc2oc1=O
: