Target
Probable maltase-glucoamylase 2
Ligand
BDBM50502037
Substrate
Meas. Tech.
ChEMBL_1806320 (CHEMBL4305679)
IC50
70±n/a nM
Citation
 Dhameja, MGupta, P Synthetic heterocyclic candidates as promising ?-glucosidase inhibitors: An overview. Eur J Med Chem 176:343-377 (2019)  
Target
Name:
Probable maltase-glucoamylase 2
Synonyms:
3.2.1.3 Glucoamylase MGAM2 Probable maltase-glucoamylase 2
Type:
PROTEIN
Mol. Mass.:
277932.17
Organism:
Homo sapiens
Description:
ChEMBL_116927
Residue:
2515
  
Inhibitor
Name:
BDBM50502037
Synonyms:
CHEMBL4453742
Type:
Small organic molecule
Emp. Form.:
C48H28Cl4N6O7S2
Mol. Mass.:
1006.714
SMILES:
Clc1ccc(C(Nc2ccc(Oc3ccc(NC(c4ccc(Cl)cc4Cl)n4nc(oc4=S)-c4cc5ccccc5oc4=O)cc3)cc2)n2nc(oc2=S)-c2cc3ccccc3oc2=O)c(Cl)c1
: