Target
Probable maltase-glucoamylase 2
Ligand
BDBM50203367
Substrate
Meas. Tech.
ChEMBL_1806299 (CHEMBL4305658)
Ki
14000±n/a nM
Citation
 Dhameja, MGupta, P Synthetic heterocyclic candidates as promising ?-glucosidase inhibitors: An overview. Eur J Med Chem 176:343-377 (2019)  
Target
Name:
Probable maltase-glucoamylase 2
Synonyms:
3.2.1.3 Glucoamylase MGAM2 Probable maltase-glucoamylase 2
Type:
PROTEIN
Mol. Mass.:
277932.17
Organism:
Homo sapiens
Description:
ChEMBL_116927
Residue:
2515
  
Inhibitor
Name:
BDBM50203367
Synonyms:
CHEMBL3891396
Type:
Small organic molecule
Emp. Form.:
C34H29BrN6O2
Mol. Mass.:
633.537
SMILES:
CCOc1ccccc1NC(=O)Cn1cc(Cn2c(nc(c2-c2ccccc2)-c2ccccc2)-c2cccc(Br)c2)nn1
: