Target
Solute carrier family 15 member 1
Ligand
BDBM50350465
Substrate
Meas. Tech.
ChEMBL_836146 (CHEMBL2077582)
IC50
10000000±n/a nM
Citation
 Covitz, KMAmidon, GLSadée, W Human dipeptide transporter, hPEPT1, stably transfected into Chinese hamster ovary cells. Pharm Res 13:1631-4 (1996)  
Target
Name:
Solute carrier family 15 member 1
Synonyms:
Intestinal H(+)/peptide cotransporter Oligopeptide transporter, small intestine isoform Peptide transporter 1 SLC15A1
Type:
PROTEIN
Mol. Mass.:
78818.07
Organism:
Homo sapiens (Human)
Description:
ChEMBL_1488839
Residue:
708
  
Inhibitor
Name:
BDBM50350465
Synonyms:
AMPICILLIN Amcill Ampicillin sulfate
Type:
Small organic molecule
Emp. Form.:
C16H19N3O4S
Mol. Mass.:
349.405
SMILES:
CC1(C)S[C@@H]2[C@H](NC(=O)[C@H](N)c3ccccc3)C(=O)N2[C@H]1C(O)=O
: