Target
Solute carrier family 22 member 1
Ligand
BDBM50149890
Substrate
Meas. Tech.
ChEMBL_836637 (CHEMBL2077479)
Ki
163000±n/a nM
Citation
 Zhang, LDresser, MJGray, ATYost, SCTerashita, SGiacomini, KM Cloning and functional expression of a human liver organic cation transporter. Mol Pharmacol 51:913-21 (1997)  
Target
Name:
Solute carrier family 22 member 1
Synonyms:
Adrenergic Alpha Organic cation transporter 1 SLC22A1 hOCT1
Type:
Enzyme Catalytic Domain
Mol. Mass.:
61154.85
Organism:
Homo sapiens (Human)
Description:
Adrenergic Alpha 0 HUMAN::O15245
Residue:
554
  
Inhibitor
Name:
BDBM50149890
Synonyms:
CHEMBL9324 | tetraethylammonium
Type:
Small organic molecule
Emp. Form.:
C8H20N
Mol. Mass.:
130.2506
SMILES:
CC[N+](CC)(CC)CC
: