Target
Aromatase
Ligand
BDBM50029231
Substrate
Meas. Tech.
ChEMBL_50719 (CHEMBL666798)
IC50
80500±n/a nM
Citation
 Rowlands, MGBarrie, SEChan, FHoughton, JJarman, MMcCague, RPotter, GA Esters of 3-pyridylacetic acid that combine potent inhibition of 17 alpha-hydroxylase/C17,20-lyase (cytochrome P45017 alpha) with resistance to esterase hydrolysis. J Med Chem 38:4191-7 (1995)  
Target
Name:
Aromatase
Synonyms:
ARO1 CP19A_HUMAN CYP19 CYPXIX Cytochrome P450 19A1 Cytochrome P450-C19 (CYP19) FL cytokine receptor precursor | P-450AROM
Type:
Enzyme
Mol. Mass.:
57888.92
Organism:
Homo sapiens (Human)
Description:
P11511
Residue:
503
  
Inhibitor
Name:
BDBM50029231
Synonyms:
2-Methyl-2-pyridin-3-yl-propionic acid (3R,6R)-3,6,8,8-tetramethyl-octahydro-3a,7-methano-azulen-6-yl ester | CHEMBL444068
Type:
Small organic molecule
Emp. Form.:
C24H35NO2
Mol. Mass.:
369.5402
SMILES:
C[C@@H]1CCC2C(C)(C)C3CC12CC[C@@]3(C)OC(=O)C(C)(C)c1cccnc1
: