Target
Aromatase
Ligand
BDBM50029236
Substrate
Meas. Tech.
ChEMBL_50719 (CHEMBL666798)
IC50
55000±n/a nM
Citation
 Rowlands, MGBarrie, SEChan, FHoughton, JJarman, MMcCague, RPotter, GA Esters of 3-pyridylacetic acid that combine potent inhibition of 17 alpha-hydroxylase/C17,20-lyase (cytochrome P45017 alpha) with resistance to esterase hydrolysis. J Med Chem 38:4191-7 (1995)  
Target
Name:
Aromatase
Synonyms:
ARO1 CP19A_HUMAN CYP19 CYPXIX Cytochrome P450 19A1 Cytochrome P450-C19 (CYP19) FL cytokine receptor precursor | P-450AROM
Type:
Enzyme
Mol. Mass.:
57888.92
Organism:
Homo sapiens (Human)
Description:
P11511
Residue:
503
  
Inhibitor
Name:
BDBM50029236
Synonyms:
2-Ethyl-2-pyridin-4-yl-butyric acid (S)-2,6,6-trimethyl-bicyclo[3.1.1]hept-3-yl ester | CHEMBL132380
Type:
Small organic molecule
Emp. Form.:
C21H31NO2
Mol. Mass.:
329.4763
SMILES:
CCC(CC)(C(=O)OC1CC2CC([C@@H]1C)C2(C)C)c1ccncc1
: