Target
Aromatase
Ligand
BDBM50029242
Substrate
Meas. Tech.
ChEMBL_50719 (CHEMBL666798)
IC50
30000±n/a nM
Citation
 Rowlands, MGBarrie, SEChan, FHoughton, JJarman, MMcCague, RPotter, GA Esters of 3-pyridylacetic acid that combine potent inhibition of 17 alpha-hydroxylase/C17,20-lyase (cytochrome P45017 alpha) with resistance to esterase hydrolysis. J Med Chem 38:4191-7 (1995)  
Target
Name:
Aromatase
Synonyms:
ARO1 CP19A_HUMAN CYP19 CYPXIX Cytochrome P450 19A1 Cytochrome P450-C19 (CYP19) FL cytokine receptor precursor | P-450AROM
Type:
Enzyme
Mol. Mass.:
57888.92
Organism:
Homo sapiens (Human)
Description:
P11511
Residue:
503
  
Inhibitor
Name:
BDBM50029242
Synonyms:
2-Methyl-2-pyridin-3-yl-propionic acid (S)-2,6,6-trimethyl-bicyclo[3.1.1]hept-3-yl ester | CHEMBL337251
Type:
Small organic molecule
Emp. Form.:
C19H27NO2
Mol. Mass.:
301.4232
SMILES:
C[C@H]1C2CC(CC1OC(=O)C(C)(C)c1cccnc1)C2(C)C
: