Target
Prothrombin
Ligand
BDBM50029504
Substrate
Meas. Tech.
ChEMBL_210582 (CHEMBL816532)
IC50
1700±n/a nM
Citation
 Shuman, RTRothenberger, RBCampbell, CSSmith, GFGifford-Moore, DSPaschal, JWGesellchen, PD Structure-activity study of tripeptide thrombin inhibitors using alpha-alkyl amino acids and other conformationally constrained amino acid substitutions. J Med Chem 38:4446-53 (1995)  
Target
Name:
Prothrombin
Synonyms:
Activation peptide fragment 1 Coagulation factor II Prothrombin Thrombin Thrombin light chain
Type:
Enzyme
Mol. Mass.:
70502.73
Organism:
Bos taurus (Bovine)
Description:
P00735
Residue:
625
  
Inhibitor
Name:
BDBM50029504
Synonyms:
CHEMBL139490 | {(S)-1-Benzyl-2-[(S)-2-((S)-1-formyl-4-guanidino-butylcarbamoyl)-piperidin-1-yl]-2-oxo-ethyl}-carbamic acid tert-butyl ester
Type:
Small organic molecule
Emp. Form.:
C26H40N6O5
Mol. Mass.:
516.633
SMILES:
CC(C)(C)OC(=O)N[C@@H](Cc1ccccc1)C(=O)N1CCCC[C@H]1C(=O)N[C@@H](CCCNC(N)=N)C=O
: