Target
Alpha-glucosidase MAL62
Ligand
BDBM50341139
Substrate
Meas. Tech.
ChEMBL_900261 (CHEMBL3068027)
IC50
66200±n/a nM
Citation
  TBA Med Chem Res 21:1762-1770 (2012)    Article 
Target
Name:
Alpha-glucosidase MAL62
Synonyms:
MAL62 MAL6S
Type:
PROTEIN
Mol. Mass.:
68174.43
Organism:
Saccharomyces cerevisiae
Description:
ChEMBL_942538
Residue:
584
  
Inhibitor
Name:
BDBM50341139
Synonyms:
CHEMBL1760551 | N-Sinapoyl serotonin
Type:
Small organic molecule
Emp. Form.:
C21H22N2O5
Mol. Mass.:
382.4098
SMILES:
COc1cc(\C=C\C(=O)NCCc2c[nH]c3ccc(O)cc23)cc(OC)c1O
: