Target
Neutrophil elastase
Ligand
BDBM50029701
Substrate
Meas. Tech.
ChEMBL_64004 (CHEMBL672345)
Ki
0.9±n/a nM
Citation
 Hlasta, DJAckerman, JHCourt, JJFarrell, RPJohnson, JAKofron, JLRobinson, DTTalomie, TGDunlap, RPFranke, CA A novel class of cyclic beta-dicarbonyl leaving groups and their use in the design of benzisothiazolone human leukocyte elastase inhibitors. J Med Chem 38:4687-92 (1995)  
Target
Name:
Neutrophil elastase
Synonyms:
Bone marrow serine protease Coagulation factor X ELANE Elastase HLE Leukocyte elastase Medullasin Neutrophil elastase (HNE) PMN elastase Trypsin
Type:
Enzyme
Mol. Mass.:
28532.38
Organism:
Homo sapiens (Human)
Description:
P08246
Residue:
267
  
Inhibitor
Name:
BDBM50029701
Synonyms:
3-Benzyl-2-(4-isopropyl-6-methoxy-1,1,3-trioxo-1,3-dihydro-1lambda*6*-benzo[d]isothiazol-2-ylmethoxy)-pyrido[1,2-a]pyrimidin-4-one | CHEMBL143215
Type:
Small organic molecule
Emp. Form.:
C27H25N3O6S
Mol. Mass.:
519.569
SMILES:
COc1cc2c(C(=O)N(COc3nc4ccccn4c(=O)c3Cc3ccccc3)S2(=O)=O)c(c1)C(C)C
: