Target
Neutrophil elastase
Ligand
BDBM50029704
Substrate
Meas. Tech.
ChEMBL_64004 (CHEMBL672345)
Ki
0.013±n/a nM
Citation
 Hlasta, DJAckerman, JHCourt, JJFarrell, RPJohnson, JAKofron, JLRobinson, DTTalomie, TGDunlap, RPFranke, CA A novel class of cyclic beta-dicarbonyl leaving groups and their use in the design of benzisothiazolone human leukocyte elastase inhibitors. J Med Chem 38:4687-92 (1995)  
Target
Name:
Neutrophil elastase
Synonyms:
Bone marrow serine protease Coagulation factor X ELANE Elastase HLE Leukocyte elastase Medullasin Neutrophil elastase (HNE) PMN elastase Trypsin
Type:
Enzyme
Mol. Mass.:
28532.38
Organism:
Homo sapiens (Human)
Description:
P08246
Residue:
267
  
Inhibitor
Name:
BDBM50029704
Synonyms:
2-(4-Benzyl-5-oxo-2,5-dihydro-furan-3-yloxymethyl)-4-isopropyl-6-methoxy-1,1-dioxo-1,2-dihydro-1lambda*6*-benzo[d]isothiazol-3-one | CHEMBL142100
Type:
Small organic molecule
Emp. Form.:
C23H23NO7S
Mol. Mass.:
457.496
SMILES:
COc1cc2c(C(=O)N(COC3=C(Cc4ccccc4)C(=O)OC3)S2(=O)=O)c(c1)C(C)C
: