Target
5-hydroxytryptamine receptor 1A
Ligand
BDBM50016777
Substrate
Meas. Tech.
ChEMBL_1094 (CHEMBL616417)
Ki
1.3±n/a nM
Citation
 Liu, YYu, HSvensson, BECortizo, LLewander, THacksell, U Derivatives of 2-(dipropylamino)tetralin: effect of the C8-substituent on the interaction with 5-HT1A receptors. J Med Chem 36:4221-9 (1994)  
Target
Name:
5-hydroxytryptamine receptor 1A
Synonyms:
5-HT-1A 5-HT1A 5-hydroxytryptamine receptor 1A (5HT1A) 5ht1a Htr1a Serotonin 1a (5-HT1a) receptor/Adrenergic receptor alpha-1 | Serotonin receptor 1A
Type:
G Protein-Coupled Receptor (GPCR)
Mol. Mass.:
46445.29
Organism:
Rattus norvegicus (rat)
Description:
Binding assays were performed using rat hippocampal membranes.
Residue:
422
  
Inhibitor
Name:
BDBM50016777
Synonyms:
((R)-8-Hydroxy-1,2,3,4-tetrahydro-naphthalen-2-yl)-dipropyl-ammonium (R)-7-Dipropylamino-5,6,7,8-tetrahydro-naphthalen-1-ol 7-Dipropylamino-5,6,7,8-tetrahydro-naphthalen-1-ol ((R)-OH-DPAT) CHEMBL26998 | R-(+)-7-Dipropylamino-5,6,7,8-tetrahydro-naphthalen-1-ol
Type:
Small organic molecule
Emp. Form.:
C16H25NO
Mol. Mass.:
247.3758
SMILES:
CCCN(CCC)[C@@H]1CCc2cccc(O)c2C1
: