Target
Acetylcholine receptor subunit beta-like 2
Ligand
BDBM50212288
Substrate
Meas. Tech.
ChEMBL_908845 (CHEMBL3067867)
Ki
3.0±n/a nM
Citation
 Tomizawa, MCasida, JE Unique neonicotinoid binding conformations conferring selective receptor interactions. J Agric Food Chem 59:2825-8 (2011)  
Target
Name:
Acetylcholine receptor subunit beta-like 2
Synonyms:
ACH4_DROME Acr96Ac Nicotinic acetylcholine receptor beta 2 nAChRbeta2 | nAcRbeta-96
Type:
PROTEIN
Mol. Mass.:
60124.10
Organism:
Drosophila melanogaster
Description:
ChEMBL_109085
Residue:
519
  
Inhibitor
Name:
BDBM50212288
Synonyms:
(2E)-1-[(6-chloropyridin-3-yl)methyl]-N-nitroimidazolidin-2-imine CHEMBL406819
Type:
Small organic molecule
Emp. Form.:
C9H10ClN5O2
Mol. Mass.:
255.661
SMILES:
[O-][N+](=O)NC1=NCCN1Cc1ccc(Cl)nc1
: